Target
Protein cereblon
Ligand
BDBM585776
Substrate
Meas. Tech.
TBD
Ki
13600±n/a nM
Citation
 Gray, NZhang, TFischer, EHe, ZDu, GDonovan, KNowak, RYuan, JT Ligands to cereblon (CRBN) US Patent  US11530219 Publication Date 12/20/2022 
Target
Name:
Protein cereblon
Synonyms:
CRBN | CRBN_HUMAN
Type:
PROTEIN
Mol. Mass.:
50537.73
Organism:
Homo sapiens (Human)
Description:
ChEMBL_116917
Residue:
442
  
Inhibitor
Name:
BDBM585776
Synonyms:
US11530219, Compound 3
Type:
Small organic molecule
Emp. Form.:
C27H25N7O6
Mol. Mass.:
543.5307
SMILES:
O=C(CNc1ccnc(NCc2ccc3OCOc3c2)n1)Nc1cccc2C(=O)N(Cc12)C1CCC(=O)NC1=O
: