Target
Protein cereblon
Ligand
BDBM585777
Substrate
Meas. Tech.
TBD
Ki
2400±n/a nM
Citation
 Gray, NZhang, TFischer, EHe, ZDu, GDonovan, KNowak, RYuan, JT Ligands to cereblon (CRBN) US Patent  US11530219 Publication Date 12/20/2022 
Target
Name:
Protein cereblon
Synonyms:
CRBN | CRBN_HUMAN
Type:
PROTEIN
Mol. Mass.:
50537.73
Organism:
Homo sapiens (Human)
Description:
ChEMBL_116917
Residue:
442
  
Inhibitor
Name:
BDBM585777
Synonyms:
US11530219, Compound 4
Type:
Small organic molecule
Emp. Form.:
C24H27N7O5
Mol. Mass.:
493.5151
SMILES:
OC[C@@H]1CCCN1c1nccc(NCC(=O)Nc2cccc3C(=O)N(Cc23)C2CCC(=O)NC2=O)n1
: