Target
Protein cereblon
Ligand
BDBM585780
Substrate
Meas. Tech.
TBD
Ki
11100±n/a nM
Citation
 Gray, NZhang, TFischer, EHe, ZDu, GDonovan, KNowak, RYuan, JT Ligands to cereblon (CRBN) US Patent  US11530219 Publication Date 12/20/2022 
Target
Name:
Protein cereblon
Synonyms:
CRBN | CRBN_HUMAN
Type:
PROTEIN
Mol. Mass.:
50537.73
Organism:
Homo sapiens (Human)
Description:
ChEMBL_116917
Residue:
442
  
Inhibitor
Name:
BDBM585780
Synonyms:
US11530219, Compound 7
Type:
Small organic molecule
Emp. Form.:
C26H25N7O5
Mol. Mass.:
515.5206
SMILES:
COc1ccc(Nc2nccc(NCC(=O)Nc3cccc4C(=O)N(Cc34)C3CCC(=O)NC3=O)n2)cc1
: