Target
Protein cereblon
Ligand
BDBM585785
Substrate
Meas. Tech.
TBD
Ki
8300±n/a nM
Citation
 Gray, NZhang, TFischer, EHe, ZDu, GDonovan, KNowak, RYuan, JT Ligands to cereblon (CRBN) US Patent  US11530219 Publication Date 12/20/2022 
Target
Name:
Protein cereblon
Synonyms:
CRBN | CRBN_HUMAN
Type:
PROTEIN
Mol. Mass.:
50537.73
Organism:
Homo sapiens (Human)
Description:
ChEMBL_116917
Residue:
442
  
Inhibitor
Name:
BDBM585785
Synonyms:
US11530219, Compound 13
Type:
Small organic molecule
Emp. Form.:
C27H22N6O5
Mol. Mass.:
510.5008
SMILES:
O=C(CNc1ccnc(n1)-c1cc2ccccc2o1)Nc1cccc2C(=O)N(Cc12)C1CCC(=O)NC1=O
: