Target
Protein cereblon
Ligand
BDBM50541818
Substrate
Meas. Tech.
TBD
Ki
130±n/a nM
Citation
 Gray, NZhang, TFischer, EHe, ZDu, GDonovan, KNowak, RYuan, JT Ligands to cereblon (CRBN) US Patent  US11530219 Publication Date 12/20/2022 
Target
Name:
Protein cereblon
Synonyms:
CRBN | CRBN_HUMAN
Type:
PROTEIN
Mol. Mass.:
50537.73
Organism:
Homo sapiens (Human)
Description:
ChEMBL_116917
Residue:
442
  
Inhibitor
Name:
BDBM50541818
Synonyms:
CHEMBL4648907 | US11530219, Compound 16
Type:
Small organic molecule
Emp. Form.:
C30H29F3N8O4
Mol. Mass.:
622.5977
SMILES:
FC(F)(F)c1cccc(c1)N1CCN(CC1)c1nccc(NCC(=O)Nc2cccc3C(=O)N(Cc23)C2CCC(=O)NC2=O)n1
: