Target
D-amino-acid oxidase
Ligand
BDBM82479
Substrate
Meas. Tech.
DAAO Enzymatic Assay
IC50
3278±n/a nM
Citation
 Tseng, YJLiu, YSun, CHwu, HLiu, CLai, W Use of known compounds as D-amino acid oxidase inhibitors US Patent  USRE49340 Publication Date 12/20/2022 
Target
Name:
D-amino-acid oxidase
Synonyms:
D-amino-acid oxidase (DAAO) DAMOX OXDA_HUMAN
Type:
Homodimer
Mol. Mass.:
39476.06
Organism:
Homo sapiens (Human)
Description:
P14920
Residue:
347
  
Inhibitor
Name:
BDBM82479
Synonyms:
CAS_132539-06-1 OLANZAPINE | USRE49340, Rank 2
Type:
Small organic molecule
Emp. Form.:
C17H20N4S
Mol. Mass.:
312.432
SMILES:
CN1CCN(CC1)C1=c2cc(C)sc2=Nc2ccccc2N1
: