Target
Tyrosine-protein kinase JAK2
Ligand
BDBM50327046
Substrate
Meas. Tech.
D3R2022
Kd
10000±n/a nM
Citation
 D3R, DD Drug Design Data Resource Grand Challenge 3 Dataset: JAK2_SC2 D3R 1:0 (2020) Target
Name:
Tyrosine-protein kinase JAK2
Synonyms:
JAK-2 JAK2_HUMAN Janus kinase 2 (JAK2) | Janus kinase 2 (a protein tyrosine kinase)
Type:
Protein
Mol. Mass.:
130684.68
Organism:
Homo sapiens (Human)
Description:
O60674
Residue:
1132
  
Inhibitor
Name:
BDBM50327046
Synonyms:
1-(2-fluoro-4-(5-methyl-5H-pyrrolo[3,2-d]pyrimidin-4-yloxy)phenyl)-3-(3-(trifluoromethyl)phenyl)urea CHEMBL1254007 | D3RKN_16
Type:
Small organic molecule
Emp. Form.:
C21H15F4N5O2
Mol. Mass.:
445.3697
SMILES:
Cn1ccc2ncnc(Oc3ccc(NC(=O)Nc4cccc(c4)C(F)(F)F)c(F)c3)c12
: