Target
Tyrosine-protein kinase Blk
Ligand
BDBM538621
Substrate
Meas. Tech.
HotSpot Assay
IC50
<0.508±n/a nM
Citation
 Starczynowski, DTThomas, CJRhyasen, GMelgar, KWalker, MMJiang, J Substituted Imidazo[1,2-a]-pyridines as IRAK 1/4 and FLT3 inhibitors US Patent  US11542261 Publication Date 1/3/2023 
Target
Name:
Tyrosine-protein kinase Blk
Synonyms:
B lymphoid tyrosine kinase BLK_HUMAN Tyrosine-protein kinase BLK (BLK) | p55-Blk
Type:
Protein
Mol. Mass.:
57711.88
Organism:
Homo sapiens (Human)
Description:
P51451
Residue:
505
  
Inhibitor
Name:
BDBM538621
Synonyms:
NCGC 00371481 US11542261, Compound I-24
Type:
Small organic molecule
Emp. Form.:
C21H23N7O
Mol. Mass.:
389.4536
SMILES:
Cn1cc(cn1)-c1cn2c(cnc2cc1CO)-c1cccc(NC2CCNC2)n1
: