Target
Tyrosine-protein kinase Blk
Ligand
BDBM538619
Substrate
Meas. Tech.
HotSpot Assay
IC50
<0.508±n/a nM
Citation
 Starczynowski, DTThomas, CJRhyasen, GMelgar, KWalker, MMJiang, J Substituted Imidazo[1,2-a]-pyridines as IRAK 1/4 and FLT3 inhibitors US Patent  US11542261 Publication Date 1/3/2023 
Target
Name:
Tyrosine-protein kinase Blk
Synonyms:
B lymphoid tyrosine kinase BLK_HUMAN Tyrosine-protein kinase BLK (BLK) | p55-Blk
Type:
Protein
Mol. Mass.:
57711.88
Organism:
Homo sapiens (Human)
Description:
P51451
Residue:
505
  
Inhibitor
Name:
BDBM538619
Synonyms:
NCGC 00371479 US11542261, Compound I-22
Type:
Small organic molecule
Emp. Form.:
C22H22N6O
Mol. Mass.:
386.4497
SMILES:
COc1cc2ncc(-c3cccc(NC4CCNC4)n3)n2cc1-c1cccnc1
: