Target
Tyrosine-protein kinase Blk
Ligand
BDBM139540
Substrate
Meas. Tech.
HotSpot Assay
IC50
<0.508±n/a nM
Citation
 Starczynowski, DTThomas, CJRhyasen, GMelgar, KWalker, MMJiang, J Substituted Imidazo[1,2-a]-pyridines as IRAK 1/4 and FLT3 inhibitors US Patent  US11542261 Publication Date 1/3/2023 
Target
Name:
Tyrosine-protein kinase Blk
Synonyms:
B lymphoid tyrosine kinase BLK_HUMAN Tyrosine-protein kinase BLK (BLK) | p55-Blk
Type:
Protein
Mol. Mass.:
57711.88
Organism:
Homo sapiens (Human)
Description:
P51451
Residue:
505
  
Inhibitor
Name:
BDBM139540
Synonyms:
US10189849, staurosporine US10329300, Staurosporine US11542261, Compound staurosporine US20230312583, Compound staurosporine US8889696, Staurosporine US9586965, Control Staurosporine
Type:
Small organic molecule
Emp. Form.:
C27H24N4O3
Mol. Mass.:
452.5045
SMILES:
CN[C@@H]1CC2OC([C@@H]1OC)n1c3ccccc3c3c4CNC(=O)c4c4c5ccccc5n2c4c13
: