Target
Mitogen-activated protein kinase kinase kinase kinase 1
Ligand
BDBM499076
Substrate
Meas. Tech.
Kinase Binding Assay
Ki
<100±n/a nM
Citation
 Vechorkin, OLiu, KPan, JSokolsky, AYe, HFYe, QYao, WHummel, J Pyrazolopyrimidine compounds and uses thereof US Patent  US11542265 Publication Date 1/3/2023 
Target
Name:
Mitogen-activated protein kinase kinase kinase kinase 1
Synonyms:
HPK1 MAP4K1
Type:
PROTEIN
Mol. Mass.:
91316.07
Organism:
Homo sapiens (Human)
Description:
ChEMBL_586597
Residue:
833
  
Inhibitor
Name:
BDBM499076
Synonyms:
US11014929, Example 114 | US11542265, Example 114
Type:
Small organic molecule
Emp. Form.:
C24H25F2N9
Mol. Mass.:
477.5124
SMILES:
CNC1CCc2c1cc(F)c(c2F)-c1ncc2[nH]nc(-c3cnc(nc3)N3CCN(C)CC3)c2n1
: