Target
Beta-secretase 2
Ligand
BDBM589185
Substrate
Meas. Tech.
n Vitro Enzymatic BACE1 and BACE2 FRET (Fluorescence Resonance Energy Transfer) Assay
IC50
2.79±n/a nM
Citation
 Allen, JRBourbeau, MPChen, NLiu, QPettus, LHSiegmund, AC Bicyclic thiazine and oxazine derivatives as beta-secretase inhibitors and methods of use US Patent  US11548903 Publication Date 1/10/2023 
Target
Name:
Beta-secretase 2
Synonyms:
AEPLC ASP1 Asp 1 Aspartyl protease 1 BACE2_HUMAN Beta-secretase (BACE) Beta-secretase 2 (BACE-2) Beta-site APP-cleaving enzyme 2 Memapsin-1 beta-Secretase (BACE-2)
Type:
Protein
Mol. Mass.:
56171.20
Organism:
Homo sapiens (Human)
Description:
Q9Y5Z0
Residue:
518
  
Inhibitor
Name:
BDBM589185
Synonyms:
US11548903, Example 117
Type:
Small organic molecule
Emp. Form.:
C33H26F3N7O2S
Mol. Mass.:
641.665
SMILES:
CC#CCOc1cnc(cn1)C(\F)=C\c1ccc(F)c(c1)[C@]12CN(C[C@H]1CSC(NC(=O)c1ccccc1)=N2)c1ncc(F)cn1
: