Target
Beta-secretase 2
Ligand
BDBM589202
Substrate
Meas. Tech.
n Vitro Enzymatic BACE1 and BACE2 FRET (Fluorescence Resonance Energy Transfer) Assay
IC50
1.78±n/a nM
Citation
 Allen, JRBourbeau, MPChen, NLiu, QPettus, LHSiegmund, AC Bicyclic thiazine and oxazine derivatives as beta-secretase inhibitors and methods of use US Patent  US11548903 Publication Date 1/10/2023 
Target
Name:
Beta-secretase 2
Synonyms:
AEPLC ASP1 Asp 1 Aspartyl protease 1 BACE2_HUMAN Beta-secretase (BACE) Beta-secretase 2 (BACE-2) Beta-site APP-cleaving enzyme 2 Memapsin-1 beta-Secretase (BACE-2)
Type:
Protein
Mol. Mass.:
56171.20
Organism:
Homo sapiens (Human)
Description:
Q9Y5Z0
Residue:
518
  
Inhibitor
Name:
BDBM589202
Synonyms:
US11548903, Example 130
Type:
Small organic molecule
Emp. Form.:
C26H22F3N7OS
Mol. Mass.:
537.559
SMILES:
[H][C@@]12CN(C[C@@]1(N=C(N)SC2)c1cc(\C=C(/F)c2ccc(cn2)C#N)ccc1F)c1nc(C)c(F)c(OC)n1
: