Target
Interleukin-4
Ligand
BDBM589821
Substrate
IC50
19.8±n/a nM
Citation
 Strohbach, JWAkama, TBlakemore, DCJacobs, RTJones, PLimburg, DCOderinde, MSPerry, MAPlattner, JJTorella, RFZhou, YYeoh, TY Substituted 1,2-oxaborolan-2-ols as PDE4 inhibitors US Patent  US11559538 Publication Date 1/24/2023 
Target
Name:
Interleukin-4
Synonyms:
B-cell stimulatory factor 1 Binetrakin IL4 Lymphocyte stimulatory factor 1 | Pitrakinra
Type:
Protein
Mol. Mass.:
17502.15
Organism:
Human
Description:
P05112
Residue:
153
  
Inhibitor
Name:
BDBM589821
Synonyms:
US11559538, Example 78 US11559538, Example 80
Type:
Small organic molecule
Emp. Form.:
C19H22BNO4S
Mol. Mass.:
371.258
SMILES:
COc1ccc(cc1OC1CCSC1)-c1cncc(c1)C1COB(O)C1
: