Target
Interferon gamma receptor 1
Ligand
BDBM589850
Substrate
IC50
5.46±n/a nM
Citation
 Strohbach, JWAkama, TBlakemore, DCJacobs, RTJones, PLimburg, DCOderinde, MSPerry, MAPlattner, JJTorella, RFZhou, YYeoh, TY Substituted 1,2-oxaborolan-2-ols as PDE4 inhibitors US Patent  US11559538 Publication Date 1/24/2023 
Target
Name:
Interferon gamma receptor 1
Synonyms:
CDw119 IFN-gamma-R-alpha IFNGR1 Interferon gamma receptor alpha-chain
Type:
Enzyme Catalytic Domain
Mol. Mass.:
54381.75
Organism:
Homo sapiens (Human)
Description:
P15260
Residue:
489
  
Inhibitor
Name:
BDBM589850
Synonyms:
US11559538, Example 104 US11559538, Example 106
Type:
Small organic molecule
Emp. Form.:
C19H24BNO4
Mol. Mass.:
341.209
SMILES:
CCCOc1cc(ccc1OCC)-c1cncc(c1)C1COB(O)C1
: