Target
Interferon gamma receptor 1
Ligand
BDBM589862
Substrate
IC50
2.45±n/a nM
Citation
 Strohbach, JWAkama, TBlakemore, DCJacobs, RTJones, PLimburg, DCOderinde, MSPerry, MAPlattner, JJTorella, RFZhou, YYeoh, TY Substituted 1,2-oxaborolan-2-ols as PDE4 inhibitors US Patent  US11559538 Publication Date 1/24/2023 
Target
Name:
Interferon gamma receptor 1
Synonyms:
CDw119 IFN-gamma-R-alpha IFNGR1 Interferon gamma receptor alpha-chain
Type:
Enzyme Catalytic Domain
Mol. Mass.:
54381.75
Organism:
Homo sapiens (Human)
Description:
P15260
Residue:
489
  
Inhibitor
Name:
BDBM589862
Synonyms:
US11559538, Example 116
Type:
Small organic molecule
Emp. Form.:
C19H22BFO4
Mol. Mass.:
344.185
SMILES:
CCCOc1c(OC)ccc(c1F)-c1cccc(c1)C1COB(O)C1
: