Target
Interferon gamma receptor 1
Ligand
BDBM589877
Substrate
IC50
24.6±n/a nM
Citation
 Strohbach, JWAkama, TBlakemore, DCJacobs, RTJones, PLimburg, DCOderinde, MSPerry, MAPlattner, JJTorella, RFZhou, YYeoh, TY Substituted 1,2-oxaborolan-2-ols as PDE4 inhibitors US Patent  US11559538 Publication Date 1/24/2023 
Target
Name:
Interferon gamma receptor 1
Synonyms:
CDw119 IFN-gamma-R-alpha IFNGR1 Interferon gamma receptor alpha-chain
Type:
Enzyme Catalytic Domain
Mol. Mass.:
54381.75
Organism:
Homo sapiens (Human)
Description:
P15260
Residue:
489
  
Inhibitor
Name:
BDBM589877
Synonyms:
US11559538, Example 129
Type:
Small organic molecule
Emp. Form.:
C21H23BO4
Mol. Mass.:
350.216
SMILES:
COc1ccc(cc1OC1CCCC1)-c1cccc(c1)C1=CB(O)OC1
: