Target
Interferon gamma receptor 1
Ligand
BDBM589881
Substrate
IC50
1.92±n/a nM
Citation
 Strohbach, JWAkama, TBlakemore, DCJacobs, RTJones, PLimburg, DCOderinde, MSPerry, MAPlattner, JJTorella, RFZhou, YYeoh, TY Substituted 1,2-oxaborolan-2-ols as PDE4 inhibitors US Patent  US11559538 Publication Date 1/24/2023 
Target
Name:
Interferon gamma receptor 1
Synonyms:
CDw119 IFN-gamma-R-alpha IFNGR1 Interferon gamma receptor alpha-chain
Type:
Enzyme Catalytic Domain
Mol. Mass.:
54381.75
Organism:
Homo sapiens (Human)
Description:
P15260
Residue:
489
  
Inhibitor
Name:
BDBM589881
Synonyms:
US11559538, Example 133
Type:
Small organic molecule
Emp. Form.:
C20H25BN2O6
Mol. Mass.:
400.233
SMILES:
CCCOc1cc(ccc1OC)-c1nc(CC(=O)OC)cc(n1)C1COB(O)C1
: