Target
Isoform PDE4B2 of cAMP-specific 3',5'-cyclic phosphodiesterase 4B
Ligand
BDBM589897
Substrate
Meas. Tech.
Cytokine Assays
IC50
0.490±n/a nM
Citation
 Strohbach, JWAkama, TBlakemore, DCJacobs, RTJones, PLimburg, DCOderinde, MSPerry, MAPlattner, JJTorella, RFZhou, YYeoh, TY Substituted 1,2-oxaborolan-2-ols as PDE4 inhibitors US Patent  US11559538 Publication Date 1/24/2023 
Target
Name:
Isoform PDE4B2 of cAMP-specific 3',5'-cyclic phosphodiesterase 4B (PDE4B2)
Synonyms:
DPDE4 PDE4B2 cAMP-specific 3',5'-cyclic phosphodiesterase 4B (PDE4B2) | phosphodiesterase 4B2
Type:
Enzyme
Mol. Mass.:
64320.36
Organism:
Homo sapiens (Human)
Description:
Q07343-2
Residue:
564
  
Inhibitor
Name:
BDBM589897
Synonyms:
US11559538, Example 149
Type:
Small organic molecule
Emp. Form.:
C20H24BNO4
Mol. Mass.:
353.22
SMILES:
COc1ccc(cc1OC1CCCC1)-c1cncc(c1)C1COB(O)C1
: