Target
Bromodomain-containing protein 2
Ligand
BDBM592507
Substrate
Meas. Tech.
Inhibitory Effect of Compounds on BRD
IC50
8.30±n/a nM
Citation
 Fan, LXu, KChen, KWang, FWu, XLuo, TZhang, SLi, XChen, Y BRD4 inhibitor US Patent  US11572371 Publication Date 2/7/2023 
Target
Name:
Bromodomain-containing protein 2
Synonyms:
BRD2 Bromodomain and extra-terminal motif (BET) Bromodomain-containing protein 2 (BRD2) RING3
Type:
Protein
Mol. Mass.:
88085.95
Organism:
Homo sapiens (Human)
Description:
P25440
Residue:
801
  
Inhibitor
Name:
BDBM592507
Synonyms:
US11572371, Compound 19
Type:
Small organic molecule
Emp. Form.:
C23H23ClN6OS
Mol. Mass.:
466.986
SMILES:
CC(C)c1nnc(CC2N=C(c3c(C)c(C)sc3-n3c(C)nnc23)c2ccc(Cl)cc2)o1
: