Target
Bromodomain-containing protein 2
Ligand
BDBM592508
Substrate
Meas. Tech.
Inhibitory Effect of Compounds on BRD
IC50
10.8±n/a nM
Citation
 Fan, LXu, KChen, KWang, FWu, XLuo, TZhang, SLi, XChen, Y BRD4 inhibitor US Patent  US11572371 Publication Date 2/7/2023 
Target
Name:
Bromodomain-containing protein 2
Synonyms:
BRD2 Bromodomain and extra-terminal motif (BET) Bromodomain-containing protein 2 (BRD2) RING3
Type:
Protein
Mol. Mass.:
88085.95
Organism:
Homo sapiens (Human)
Description:
P25440
Residue:
801
  
Inhibitor
Name:
BDBM592508
Synonyms:
US11572371, Compound 22
Type:
Small organic molecule
Emp. Form.:
C24H25ClN6OS
Mol. Mass.:
481.013
SMILES:
Cc1nnc2C(Cc3nnc(o3)C(C)(C)C)N=C(c3c(C)c(C)sc3-n12)c1ccc(Cl)cc1
: