Target
Prothrombin
Ligand
BDBM50138663
Substrate
Meas. Tech.
Enzymatic Assay for Thrombin
Ki
17500±n/a nM
Citation
 Cutshall, NSGage, JLGruswitz, FAKhalaf, JLittle, TLMetz, MNguyen, JHNollert von Specht, PKTsoung, JCicirelli, MGoldstein, SRKeshipeddy, SKKwon, DYLemus, RHVaddela, SB MASP-2 inhibitors and methods of use US Patent  US11584714 Publication Date 2/21/2023 
Target
Name:
Prothrombin
Synonyms:
Activation peptide fragment 1 Coagulation factor II Prothrombin precursor Thrombin heavy chain | Thrombin light chain
Type:
Protein
Mol. Mass.:
70029.57
Organism:
Homo sapiens (Human)
Description:
P00734
Residue:
622
  
Inhibitor
Name:
BDBM50138663
Synonyms:
2-naphthimidamide Naphthalene-2-carboxamidine uPa_6
Type:
Small organic molecule
Emp. Form.:
C11H10N2
Mol. Mass.:
170.2105
SMILES:
NC(=N)c1ccc2ccccc2c1
: