Target
ATP-sensitive inward rectifier potassium channel 10
Ligand
BDBM600745
Substrate
Meas. Tech.
thallium-flux assay
IC50
>30000±n/a nM
Citation
 Swale, DRFoil, LD Method for controlling hematophagous or sap-feeding arthropods US Patent  US11632953 Publication Date 4/25/2023 
Target
Name:
ATP-sensitive inward rectifier potassium channel 10
Synonyms:
ATP-dependent inwardly rectifying potassium channel Kir4.1 KCJ10_HUMAN Potassium channel, inwardly rectifying subfamily J member 10
Type:
PROTEIN
Mol. Mass.:
42513.64
Organism:
Homo sapiens (Human)
Description:
ChEMBL_105175
Residue:
379
  
Inhibitor
Name:
BDBM600745
Synonyms:
US11632953, Compound 1 | US11632953, Compound VU041
Type:
Small organic molecule
Emp. Form.:
C19H20F3N3O
Mol. Mass.:
363.3768
SMILES:
FC(F)(F)c1nn(CC(=O)N2CCCc3ccccc23)c2CCCCc12
: