Target
Cholinesterase
Ligand
BDBM9061
Substrate
BDBM8978
Meas. Tech.
Enzyme Inhibition Assay
IC50
3.8±n/a nM
Citation
 Hu, MKWu, LJHsiao, GYen, MH Homodimeric tacrine congeners as acetylcholinesterase inhibitors. J Med Chem 45:2277-82 (2002)  
Target
Name:
Cholinesterase
Synonyms:
Acylcholine acylhydrolase Butyrylcholine esterase (BChE) Butyrylcholinesterase (BuChE) CHLE_HUMAN Cholinesterases Pseudocholinesterase
Type:
Homotetramer
Mol. Mass.:
68422.27
Organism:
Homo sapiens (Human)
Description:
P06276
Residue:
602
  
Inhibitor
Name:
BDBM9061
Synonyms:
Homodimeric Tacrine Analog 4c N-(8-{6H,7H,8H,9H,10H-cyclohepta[b]quinolin-11-ylamino}octyl)-6H,7H,8H,9H,10H-cyclohepta[b]quinolin-11-amine
Type:
Small organic molecule
Emp. Form.:
C36H46N4
Mol. Mass.:
534.7772
SMILES:
C(CCCCNc1c2CCCCCc2nc2ccccc12)CCCNc1c2CCCCCc2nc2ccccc12
:
Substrate
Name:
BDBM8978
Synonyms:
(Propylcarbonylthioethyl)trimethylammonium iodide CHEMBL148530 butyrylthiocholine | butyrylthiocholine chloride
Type:
Small organic molecule
Emp. Form.:
C9H20NOS
Mol. Mass.:
190.326
SMILES:
CCCC(=O)SCC[N+](C)(C)C
: