Target
Dual specificity calcium/calmodulin-dependent 3',5'-cyclic nucleotide phosphodiesterase 1B
Ligand
BDBM279104
Substrate
Meas. Tech.
PDE1 Inhibition Assay
IC50
0.095±n/a nM
Citation
 Kehler, JJuhl, KMarigo, MVital, PJJessing, MLanggård, MRasmussen, LKClementson, CM Combination treatments comprising administration of 1H-pyrazolo[4,3-b]pyridines US Patent  US11634416 Publication Date 4/25/2023 
Target
Name:
Dual specificity calcium/calmodulin-dependent 3',5'-cyclic nucleotide phosphodiesterase 1B
Synonyms:
63 kDa Cam-PDE Calcium/calmodulin-dependent 3',5'-cyclic nucleotide phosphodiesterase 1B PDE1B PDE1B_HUMAN Phosphodiesterase 1B Phosphodiesterase Type 1 (PDE1B) | Phosphodiesterase, PDE1/PDE5
Type:
Enzyme
Mol. Mass.:
61366.51
Organism:
Homo sapiens (Human)
Description:
Residue:
536
  
Inhibitor
Name:
BDBM279104
Synonyms:
3-methyl-1-[1-methylpropyl]-5-(2-propoxy-3-pyridyl)-N-(1H-pyrazol-3-ylmethyl)pyrazolo[4,3-b]pyridin-7-amine,enantiomer 2 US10512632, Example 135 US10806718, Example 135 US11634416, Example 135
Type:
Small organic molecule
Emp. Form.:
C23H29N7O
Mol. Mass.:
419.5227
SMILES:
CCCOc1ncccc1-c1cc(NCc2cc[nH]n2)c2n(nc(C)c2n1)C(C)CC
: