Target
Bromodomain-containing protein 2
Ligand
BDBM192755
Substrate
Meas. Tech.
Alpha Screen Assay
IC50
2.63±n/a nM
Citation
 Schönbrunn, ELawrence, NJLawrence, HR BRD4-kinase inhibitors as cancer therapeutics US Patent  US11643396 Publication Date 5/9/2023 
Target
Name:
Bromodomain-containing protein 2
Synonyms:
BRD2 Bromodomain and extra-terminal motif (BET) Bromodomain-containing protein 2 (BRD2) RING3
Type:
Protein
Mol. Mass.:
88085.95
Organism:
Homo sapiens (Human)
Description:
P25440
Residue:
801
  
Inhibitor
Name:
BDBM192755
Synonyms:
TG101209 US11643396, Example TG101209
Type:
Small organic molecule
Emp. Form.:
C26H35N7O2S
Mol. Mass.:
509.667
SMILES:
CN1CCN(CC1)c1ccc(Nc2ncc(C)c(Nc3cccc(c3)S(=O)(=O)NC(C)(C)C)n2)cc1
: