Target
Cholinesterase
Ligand
BDBM9062
Substrate
BDBM8978
Meas. Tech.
Cholinesterase Inhibition Assay
IC50
50±n/a nM
Citation
 Alonso, DDorronsoro, IRubio, LMunoz, PGarcia-Palomero, EDel Monte, MBidon-Chanal, AOrozco, MLuque, FJCastro, AMedina, MMartinez, A Donepezil-tacrine hybrid related derivatives as new dual binding site inhibitors of AChE. Bioorg Med Chem 13:6588-97 (2005)  
Target
Name:
Cholinesterase
Synonyms:
Acylcholine acylhydrolase Butyrylcholine esterase (BChE) Butyrylcholinesterase (BuChE) CHLE_HUMAN Cholinesterases Pseudocholinesterase
Type:
Homotetramer
Mol. Mass.:
68422.27
Organism:
Homo sapiens (Human)
Description:
P06276
Residue:
602
  
Inhibitor
Name:
BDBM9062
Synonyms:
5,6-Dimethoxy-2-{[6-(1,2,3,4-tetrahydro-acridin-9-ylamino)-hexylamino]-methyl}-indan-1-one Donepezil-tacrine hybrid 7
Type:
Small organic molecule
Emp. Form.:
C31H39N3O3
Mol. Mass.:
501.6597
SMILES:
COc1cc2CC(CNCCCCCCNc3c4CCCCc4nc4ccccc34)C(=O)c2cc1OC
:
Substrate
Name:
BDBM8978
Synonyms:
(Propylcarbonylthioethyl)trimethylammonium iodide CHEMBL148530 butyrylthiocholine | butyrylthiocholine chloride
Type:
Small organic molecule
Emp. Form.:
C9H20NOS
Mol. Mass.:
190.326
SMILES:
CCCC(=O)SCC[N+](C)(C)C
: