Target
Kappa-type opioid receptor
Ligand
BDBM602184
Substrate
Meas. Tech.
Agonistic activity of the kappa-opioid receptors
EC50
0.009±n/a nM
Citation
 Gao, JFu, XZhong, GZhou, HHu, HHu, XYuan, YLi, YLi, S Polypeptide compound, pharmaceutical composition, preparation method and application thereof US Patent  US11643436 Publication Date 5/9/2023 
Target
Name:
Kappa-type opioid receptor
Synonyms:
K-OR-1 Kappa-opioid receptor (KOR) Kappa-type opioid receptor (KOR) OPIATE Kappa OPRK1 kappa opioid receptor (KOR)
Type:
G Protein-Coupled Receptor (GPCR)
Mol. Mass.:
42648.76
Organism:
Homo sapiens (Human)
Description:
P41145
Residue:
380
  
Inhibitor
Name:
BDBM602184
Synonyms:
US11643436, Compound TM-7
Type:
Small organic molecule
Emp. Form.:
C38H57BN6O6
Mol. Mass.:
704.707
SMILES:
CC(C)C[C@@H](NC(=O)[C@@H](Cc1ccccc1)NC(=O)[C@H](N)Cc1ccccc1)C(=O)N[C@H](CCCCN)C(=O)N1CCC2(CC(C2)B(O)O)CC1
: