Target
Kappa-type opioid receptor
Ligand
BDBM602188
Substrate
Meas. Tech.
Agonistic activity of the kappa-opioid receptors
EC50
0.009±n/a nM
Citation
 Gao, JFu, XZhong, GZhou, HHu, HHu, XYuan, YLi, YLi, S Polypeptide compound, pharmaceutical composition, preparation method and application thereof US Patent  US11643436 Publication Date 5/9/2023 
Target
Name:
Kappa-type opioid receptor
Synonyms:
K-OR-1 Kappa-opioid receptor (KOR) Kappa-type opioid receptor (KOR) OPIATE Kappa OPRK1 kappa opioid receptor (KOR)
Type:
G Protein-Coupled Receptor (GPCR)
Mol. Mass.:
42648.76
Organism:
Homo sapiens (Human)
Description:
P41145
Residue:
380
  
Inhibitor
Name:
BDBM602188
Synonyms:
US11643436, Compound TM-22B
Type:
Small organic molecule
Emp. Form.:
C39H61BN6O8
Mol. Mass.:
752.748
SMILES:
COCCOCCNCCCC[C@@H](NC(=O)[C@@H](CC(C)C)NC(=O)[C@@H](Cc1ccccc1)NC(=O)[C@H](N)Cc1ccccc1)C(=O)N1CC[C@H](C1)B(O)O
: