Target
Monoglyceride lipase
Ligand
BDBM483685
Substrate
Meas. Tech.
In Vitro Competitive Activity-Based Protein Assay
IC50
<100±n/a nM
Citation
 Grice, CAWiener, JJWeber, ODDuncan, KK Pyrazole MAGL inhibitors US Patent  US11655217 Publication Date 5/23/2023 
Target
Name:
Monoglyceride lipase
Synonyms:
HU-K5 Lysophospholipase-like MGL MGLL_HUMAN
Type:
Hydrolase
Mol. Mass.:
33264.56
Organism:
Homo sapiens (Human)
Description:
Human recombinant MGL (Cayman Chemical, cat# 10008354).
Residue:
303
  
Inhibitor
Name:
BDBM483685
Synonyms:
1-(2-(5-chloro-2- (trifluoromethyl)- benzyl)-2,8- diazaspiro[4.5]- decane-8-carbonyl)- 4-methyl-1H- pyrazole-3- carboxylic acid US11655217, Example 130
Type:
Small organic molecule
Emp. Form.:
C22H24ClF3N4O3
Mol. Mass.:
484.899
SMILES:
Cc1cn(nc1C(O)=O)C(=O)N1CCC2(CCN(Cc3cc(Cl)ccc3C(F)(F)F)C2)CC1
: