Target
P2X purinoceptor 7
Ligand
BDBM254381
Substrate
Meas. Tech.
FLIPR Ca2+ Flux Assay
IC50
6.80±n/a nM
Citation
 Alcazar Vaca, MJAndres Gil, JIChrovian, CCCoate, HRDe Angelis, MDvorak, CAGelin, CFLetavic, MASavall, BMSoyode-Johnson, AStenne, BMSwanson, DM P2X7 modulators US Patent  US10150765 Publication Date 12/11/2018 
Target
Name:
P2X purinoceptor 7
Synonyms:
ATP receptor P2RX7_HUMAN P2X purinoceptor 7 (P2X7) P2Z receptor | Purinergic receptor
Type:
Protein
Mol. Mass.:
68602.85
Organism:
Homo sapiens (Human)
Description:
Q99572
Residue:
595
  
Inhibitor
Name:
BDBM254381
Synonyms:
US10112937, Example 288 US10703749, Example 288 | US9464084, 288
Type:
Small organic molecule
Emp. Form.:
C20H16ClF3N4O
Mol. Mass.:
420.815
SMILES:
C[C@H]1Cc2c(CN1C(=O)c1cccc(c1Cl)C(F)(F)F)nnn2-c1ccccc1
: