Target
Fibroblast growth factor receptor 4
Ligand
BDBM357727
Substrate
Meas. Tech.
FGFR Enzymatic Assay
IC50
<10±n/a nM
Citation
 Lu, LWu, LQian, DYao, W Bicyclic heterocycles as FGFR4 inhibitors US Patent  US11667635 Publication Date 6/6/2023 
Target
Name:
Fibroblast growth factor receptor 4
Synonyms:
CD_antigen: CD334 FGFR4 FGFR4 Fibroblast growth factor receptor JK2 TKF
Type:
Protein
Mol. Mass.:
87957.45
Organism:
Homo sapiens (Human)
Description:
P22455
Residue:
802
  
Inhibitor
Name:
BDBM357727
Synonyms:
(S)—N-((3-(2,6-difluoro-3,5-dimethoxyphenyl)-2-oxo-1-((tetrahydrofuran-3-yl)methyl)-1,2,3,4-tetrahydropyrido[4,3-d]pyrimidin-7-yl)methyl)acrylamide US10738048, Example 31 US11667635, Example 31 | US9890156, Example 31
Type:
Small organic molecule
Emp. Form.:
C24H26F2N4O5
Mol. Mass.:
488.4838
SMILES:
COc1cc(OC)c(F)c(N2Cc3cnc(CNC(=O)C=C)cc3N(C[C@@H]3CCOC3)C2=O)c1F
: