Target
Tyrosine-protein kinase JAK1
Ligand
BDBM604898
Substrate
Meas. Tech.
Biochemical JAK Kinase Assay
Ki
0.050±n/a nM
Citation
 Fatheree, PRBrandt, GESmith, CSullivan, SDVan Orden, LJKleinschek, MACrater, GD Fused imidazo-piperidine JAK inhibitors US Patent  US11667637 Publication Date 6/6/2023 
Target
Name:
Tyrosine-protein kinase JAK1
Synonyms:
JAK-1 JAK1A JAK1_HUMAN Janus kinase 1 (JAK1) | Janus kinase 1 JAK1
Type:
Protein
Mol. Mass.:
133293.73
Organism:
Homo sapiens (Human)
Description:
P23458
Residue:
1154
  
Inhibitor
Name:
BDBM604898
Synonyms:
US11667637, Example 1-2
Type:
Small organic molecule
Emp. Form.:
C29H34FN7O2
Mol. Mass.:
531.6244
SMILES:
CCc1cc(O)c(F)cc1-c1ccc2c(n[nH]c2c1)-c1nc2C[C@H](NCc2[nH]1)C(=O)N1CCN(CC1)C(C)C
: