Target
Orexin/Hypocretin receptor type 1
Ligand
BDBM118375
Substrate
Meas. Tech.
Human Orexin 1 Receptor Radioligand Binding Studies
Ki
1787±n/a nM
Citation
 Chai, WLetavic, MALy, KSPippel, DJRudolph, DASappey, KCSavall, BMShah, CRShireman, BTJohnson, ASStocking, EMSwanson, DM Disubstituted octahydropyrrolo[3,4-c]pyrroles as orexin receptor modulators US Patent  US11667644 Publication Date 6/6/2023 
Target
Name:
Orexin/Hypocretin receptor type 1
Synonyms:
HCRTR1 OX1R_HUMAN Orexin receptor type 1 (OR 1) Orexin receptor type 1 (OX1) Orexin receptor type 1 (OxR1) | Ox1r
Type:
Protein
Mol. Mass.:
47554.50
Organism:
Homo sapiens (Human)
Description:
O43613
Residue:
425
  
Inhibitor
Name:
BDBM118375
Synonyms:
US11059828, Example 28 US8653263, 28 USRE48841, Example 28
Type:
Small organic molecule
Emp. Form.:
C27H23FN4O
Mol. Mass.:
438.4961
SMILES:
Fc1ccc(cc1)-c1ccccc1C(=O)N1CC2CN(CC2C1)c1cnc2ccccc2n1
: