Target
Bcl-2-like protein 11 [51-76]/Induced myeloid leukemia cell differentiation protein Mcl-1 [171-327]
Ligand
BDBM605237
Substrate
Meas. Tech.
AlphaLISA Assay
IC50
0.019±n/a nM
Citation
 Chu, HGuerrero, JAHurtley, AEJiang, LKato, DKobayashi, TLin, DWMedley, JWNaduthambi, DTsui, VHVenkataramani, CWatkins, WJYang, HZhu, Q MCL1 inhibitors US Patent  US11667652 Publication Date 6/6/2023 
Target
Name:
Bcl-2-like protein 11 [51-76]/Induced myeloid leukemia cell differentiation protein Mcl-1 [171-327]
Synonyms:
Bcl-2-like protein 11 [51-76]/Induced myeloid leukemia cell differentiation protein Mcl-1 [171-327] Mcl-1 and BIM | Mcl-1/BIM
Type:
Protein
Mol. Mass.:
Description:
Components:
This complex has 2 components.
Component 1
Name:
Induced myeloid leukemia cell differentiation protein Mcl-1 [171-327]
Synonyms:
BCL2L3 MCL1 Myeloid cell leukemia 1 (Mcl-1)
Type:
Enzyme Catalytic Domain
Mol. Mass.:
17896.13
Organism:
Homo sapiens (Human)
Description:
Q07820[171-327]
Residue:
157
  
Component 2
Name:
Bcl-2-like protein 11 [51-76]
Synonyms:
B2L11_HUMAN BIM Bcl-2-like protein 11 (BIM) (51-76)
Type:
Enzyme Catalytic Domain
Mol. Mass.:
2530.22
Organism:
Homo sapiens (Human)
Description:
O43521[51-76]
Residue:
26
  
Inhibitor
Name:
BDBM605237
Synonyms:
US11667652, Example 33
Type:
Small organic molecule
Emp. Form.:
C41H49ClN8O5S
Mol. Mass.:
801.396
SMILES:
C[C@H]1C\C=C\[C@H](O)[C@@H]2CC[C@H]2CN2C[C@@]3(CCCc4cc(Cl)ccc34)COc3ccc(cc23)C(=O)N=[S@@](=O)(C1)Nc1nc(nc2nn(C)cc12)N1CCOCC1
: