Target
Bcl-2-like protein 11 [51-76]/Induced myeloid leukemia cell differentiation protein Mcl-1 [171-327]
Ligand
BDBM605358
Substrate
Meas. Tech.
AlphaLISA Assay
IC50
0.027±n/a nM
Citation
 Chu, HGuerrero, JAHurtley, AEJiang, LKato, DKobayashi, TLin, DWMedley, JWNaduthambi, DTsui, VHVenkataramani, CWatkins, WJYang, HZhu, Q MCL1 inhibitors US Patent  US11667652 Publication Date 6/6/2023 
Target
Name:
Bcl-2-like protein 11 [51-76]/Induced myeloid leukemia cell differentiation protein Mcl-1 [171-327]
Synonyms:
Bcl-2-like protein 11 [51-76]/Induced myeloid leukemia cell differentiation protein Mcl-1 [171-327] Mcl-1 and BIM | Mcl-1/BIM
Type:
Protein
Mol. Mass.:
Description:
Components:
This complex has 2 components.
Component 1
Name:
Induced myeloid leukemia cell differentiation protein Mcl-1 [171-327]
Synonyms:
BCL2L3 MCL1 Myeloid cell leukemia 1 (Mcl-1)
Type:
Enzyme Catalytic Domain
Mol. Mass.:
17896.13
Organism:
Homo sapiens (Human)
Description:
Q07820[171-327]
Residue:
157
  
Component 2
Name:
Bcl-2-like protein 11 [51-76]
Synonyms:
B2L11_HUMAN BIM Bcl-2-like protein 11 (BIM) (51-76)
Type:
Enzyme Catalytic Domain
Mol. Mass.:
2530.22
Organism:
Homo sapiens (Human)
Description:
O43521[51-76]
Residue:
26
  
Inhibitor
Name:
BDBM605358
Synonyms:
US11667652, Example 152
Type:
Small organic molecule
Emp. Form.:
C43H57ClN6O6S
Mol. Mass.:
821.467
SMILES:
COc1nn(C)cc1C(=O)N[S@@]1(=O)=NC(=O)c2ccc3OC[C@]4(CCCc5cc(Cl)ccc45)CN(C[C@@H]4CC[C@H]4[C@H]4O[C@H](CCN(C)C)C[C@@H]4CC[C@H](C)C1)c3c2
: