Target
Cyclin-T1/Cyclin-dependent kinase 9
Ligand
BDBM605530
Substrate
Meas. Tech.
CDK4/CyclinD1 Enzymatic Activity Assay
IC50
0.980±n/a nM
Citation
 Lu, LShetty, RCombs, APDai, CLeal, RABersch, KL CDK inhibitors and their use as pharmaceuticals US Patent  US11673893 Publication Date 6/13/2023 
Target
Name:
Cyclin-T1/Cyclin-dependent kinase 9
Synonyms:
CDK9/ Cyclin-T1 CDK9/Cyclin T Cyclin T1/dependent kinase 9 | Cyclin-Dependent Kinase 9 (CDK9)
Type:
Protein Complex
Mol. Mass.:
Description:
Components:
This complex has 2 components.
Component 1
Name:
Cyclin-T1
Synonyms:
CCNT1 CycT Cyclin T Cyclin-T
Type:
Enzyme Subunit
Mol. Mass.:
80712.40
Organism:
Homo sapiens (Human)
Description:
Residue:
726
  
Component 2
Name:
Cyclin-dependent kinase 9
Synonyms:
C-2K CDK9 Cell division cycle 2-like protein kinase 4 Cyclin-Dependent Kinase 9 (CDK9) Serine/threonine-protein kinase PITALRE Tat-associated kinase complex catalytic subunit
Type:
Enzyme Subunit
Mol. Mass.:
42789.13
Organism:
Homo sapiens (Human)
Description:
Residue:
372
  
Inhibitor
Name:
BDBM605530
Synonyms:
N-((1R,3S)-3-((5-chloro-4-(7-fluoro-3-isopropyl-2-methyl- 2H-indazol-5-yl)pyridin-2-yl)carbamoyl)-cyclohexyl)-4- methylpiperazine-1-carboxamide | US11673893, Example 8
Type:
Small organic molecule
Emp. Form.:
C29H37ClFN7O2
Mol. Mass.:
570.101
SMILES:
CC(C)c1n(C)nc2c(F)cc(cc12)-c1cc(NC(=O)[C@H]2CCC[C@H](C2)NC(=O)N2CCN(C)CC2)ncc1Cl
: