Target
Cyclin-T1/Cyclin-dependent kinase 9
Ligand
BDBM605604
Substrate
Meas. Tech.
CDK4/CyclinD1 Enzymatic Activity Assay
IC50
0.938±n/a nM
Citation
 Lu, LShetty, RCombs, APDai, CLeal, RABersch, KL CDK inhibitors and their use as pharmaceuticals US Patent  US11673893 Publication Date 6/13/2023 
Target
Name:
Cyclin-T1/Cyclin-dependent kinase 9
Synonyms:
CDK9/ Cyclin-T1 CDK9/Cyclin T Cyclin T1/dependent kinase 9 | Cyclin-Dependent Kinase 9 (CDK9)
Type:
Protein Complex
Mol. Mass.:
Description:
Components:
This complex has 2 components.
Component 1
Name:
Cyclin-T1
Synonyms:
CCNT1 CycT Cyclin T Cyclin-T
Type:
Enzyme Subunit
Mol. Mass.:
80712.40
Organism:
Homo sapiens (Human)
Description:
Residue:
726
  
Component 2
Name:
Cyclin-dependent kinase 9
Synonyms:
C-2K CDK9 Cell division cycle 2-like protein kinase 4 Cyclin-Dependent Kinase 9 (CDK9) Serine/threonine-protein kinase PITALRE Tat-associated kinase complex catalytic subunit
Type:
Enzyme Subunit
Mol. Mass.:
42789.13
Organism:
Homo sapiens (Human)
Description:
Residue:
372
  
Inhibitor
Name:
BDBM605604
Synonyms:
US11673893, Example 74
Type:
Small organic molecule
Emp. Form.:
C25H26ClF4N5O3
Mol. Mass.:
555.952
SMILES:
CC(=O)N[C@@H]1CCC[C@@H](C1)C(=O)Nc1cc(c(Cl)cn1)-c1cc(F)c2nn(C)c(c2c1)C(C)(O)C(F)(F)F
: