Target
Tyrosine-protein kinase JAK3
Ligand
BDBM472916
Substrate
Meas. Tech.
Biochemical JAK Kinase Assays
Ki
0.063±n/a nM
Citation
 Long, DDSmith, CThompson, C 5 to 7 membered heterocyclic amides as JAK inhibitors US Patent  US11713315 Publication Date 8/1/2023 
Target
Name:
Tyrosine-protein kinase JAK3
Synonyms:
JAK-3 JAK3_HUMAN Janus kinase 3 (JAK3) L-JAK | Leukocyte janus kinase
Type:
Protein
Mol. Mass.:
125111.08
Organism:
Homo sapiens (Human)
Description:
P52333
Residue:
1124
  
Inhibitor
Name:
BDBM472916
Synonyms:
US10836763, Example 3 | US11713315, Example 3
Type:
Small organic molecule
Emp. Form.:
C29H35N7O2
Mol. Mass.:
513.6339
SMILES:
CCc1cc(O)ccc1-c1ccc2c(n[nH]c2c1)-c1nc2C[C@H](N(C)Cc2[nH]1)C(=O)N1CCN(C)C[C@@H]1C
: