Target
Synaptic vesicular amine transporter
Ligand
BDBM611858
Substrate
Meas. Tech.
Methods for Determining VMAT2 Inhibitory Activity of a Compound
Ki
1.10±n/a nM
Citation
 Harriott, NPagano, NBoon, BA Substituted pyrido[2,1-a]isoquinolines as VMAT2 inhibitors US Patent  US11718618 Publication Date 8/8/2023 
Target
Name:
Synaptic vesicular amine transporter
Synonyms:
Monoamine transporter SVMT VAT2 VMAT2_HUMAN | Vesicular amine transporter 2
Type:
PROTEIN
Mol. Mass.:
55709.61
Organism:
Homo sapiens (Human)
Description:
ChEMBL_610810
Residue:
514
  
Inhibitor
Name:
BDBM611858
Synonyms:
(2R,3R,11bR)-3-(2,2- dimethylpropyl)-9-ethoxy-10- methoxy- 1H,2H,3H,4H,6H,7H,11bH- pyrido[2,1-a]isoquinolin-2-ol US11718618, Compound 4-17
Type:
Small organic molecule
Emp. Form.:
C21H33NO3
Mol. Mass.:
347.4916
SMILES:
CCOc1cc2CCN3C[C@@H](CC(C)(C)C)[C@H](O)C[C@@H]3c2cc1OC
: