Target
Synaptic vesicular amine transporter
Ligand
BDBM611895
Substrate
Meas. Tech.
Methods for Determining VMAT2 Inhibitory Activity of a Compound
Ki
1.40±n/a nM
Citation
 Harriott, NPagano, NBoon, BA Substituted pyrido[2,1-a]isoquinolines as VMAT2 inhibitors US Patent  US11718618 Publication Date 8/8/2023 
Target
Name:
Synaptic vesicular amine transporter
Synonyms:
Monoamine transporter SVMT VAT2 VMAT2_HUMAN | Vesicular amine transporter 2
Type:
PROTEIN
Mol. Mass.:
55709.61
Organism:
Homo sapiens (Human)
Description:
ChEMBL_610810
Residue:
514
  
Inhibitor
Name:
BDBM611895
Synonyms:
(2R,3R,11bR)-3-(2,2- dimethylpropyl)-10-methoxy- 9-[(2S)-3,3,3-trifluoro-2- hydroxypropoxy]- 1H,2H,3H,4H,6H,7H,11bH- pyrido[2,1-a]isoquinolin-2-ol | US11718618, Compound 4-50
Type:
Small organic molecule
Emp. Form.:
C22H32F3NO4
Mol. Mass.:
431.489
SMILES:
COc1cc2[C@H]3C[C@@H](O)[C@H](CC(C)(C)C)CN3CCc2cc1OC[C@H](O)C(F)(F)F
: