Target
Synaptic vesicular amine transporter
Ligand
BDBM611953
Substrate
Meas. Tech.
Methods for Determining VMAT2 Inhibitory Activity of a Compound
Ki
1.50±n/a nM
Citation
 Harriott, NPagano, NBoon, BA Substituted pyrido[2,1-a]isoquinolines as VMAT2 inhibitors US Patent  US11718618 Publication Date 8/8/2023 
Target
Name:
Synaptic vesicular amine transporter
Synonyms:
Monoamine transporter SVMT VAT2 VMAT2_HUMAN | Vesicular amine transporter 2
Type:
PROTEIN
Mol. Mass.:
55709.61
Organism:
Homo sapiens (Human)
Description:
ChEMBL_610810
Residue:
514
  
Inhibitor
Name:
BDBM611953
Synonyms:
(2R,3R,11bR)-3-(2,2- dimethylpropyl)-10-methoxy- 9-(4,4,4-trifluorobutoxy)- 1H,2H,3H,4H,6H,7H,11bH- pyrido[2,1-a]isoquinolin-2-ol | US11718618, Compound 4-120
Type:
Small organic molecule
Emp. Form.:
C23H34F3NO3
Mol. Mass.:
429.5162
SMILES:
COc1cc2[C@H]3C[C@@H](O)[C@H](CC(C)(C)C)CN3CCc2cc1OCCCC(F)(F)F
: