Target
Epoxide hydrolase 1
Ligand
BDBM408981
Substrate
Meas. Tech.
Inhibitors of Soluble Epoxide Hydrolase (sEH)
Ki
0.640±0.17 nM
Citation
 Chiamvimonvat, NHammock, BDSirish, P Methods of improving cell-based therapy US Patent  US11723929 Publication Date 8/15/2023 
Target
Name:
Epoxide hydrolase 1
Synonyms:
EPHX EPOX Epoxide hydrolase (HsEH) HYEP_HUMAN | Microsomal epoxide hydrolase
Type:
Protein
Mol. Mass.:
52954.28
Organism:
Homo sapiens (Human)
Description:
P07099
Residue:
455
  
Inhibitor
Name:
BDBM408981
Synonyms:
US10377744, Compound No. 2 US11723929, Compound 2
Type:
Small organic molecule
Emp. Form.:
C18H19F3N4O3
Mol. Mass.:
396.3637
SMILES:
FC(F)(F)Oc1ccc(NC(=O)NC2CCN(CC2)C(=O)c2cc[nH]c2)cc1
: