Target
Epoxide hydrolase 1
Ligand
BDBM408985
Substrate
Meas. Tech.
Inhibitors of Soluble Epoxide Hydrolase (sEH)
Ki
0.550±0.06 nM
Citation
 Chiamvimonvat, NHammock, BDSirish, P Methods of improving cell-based therapy US Patent  US11723929 Publication Date 8/15/2023 
Target
Name:
Epoxide hydrolase 1
Synonyms:
EPHX EPOX Epoxide hydrolase (HsEH) HYEP_HUMAN | Microsomal epoxide hydrolase
Type:
Protein
Mol. Mass.:
52954.28
Organism:
Homo sapiens (Human)
Description:
P07099
Residue:
455
  
Inhibitor
Name:
BDBM408985
Synonyms:
US10377744, Compound No. 6 US11723929, Compound 6
Type:
Small organic molecule
Emp. Form.:
C19H20F3N3O4
Mol. Mass.:
411.375
SMILES:
Cc1occc1C(=O)N1CCC(CC1)NC(=O)Nc1ccc(OC(F)(F)F)cc1
: