Target
Epoxide hydrolase 1
Ligand
BDBM408989
Substrate
Meas. Tech.
Inhibitors of Soluble Epoxide Hydrolase (sEH)
Ki
1.21±0.2 nM
Citation
 Chiamvimonvat, NHammock, BDSirish, P Methods of improving cell-based therapy US Patent  US11723929 Publication Date 8/15/2023 
Target
Name:
Epoxide hydrolase 1
Synonyms:
EPHX EPOX Epoxide hydrolase (HsEH) HYEP_HUMAN | Microsomal epoxide hydrolase
Type:
Protein
Mol. Mass.:
52954.28
Organism:
Homo sapiens (Human)
Description:
P07099
Residue:
455
  
Inhibitor
Name:
BDBM408989
Synonyms:
US10377744, Compound No. 10 US11723929, Compound 10
Type:
Small organic molecule
Emp. Form.:
C18H18F3N3O3
Mol. Mass.:
381.349
SMILES:
FC(F)(F)c1ccc(NC(=O)NC2CCN(CC2)C(=O)c2ccoc2)cc1
: