Target
Epoxide hydrolase 1
Ligand
BDBM408992
Substrate
Meas. Tech.
Inhibitors of Soluble Epoxide Hydrolase (sEH)
Ki
0.220±0.01 nM
Citation
 Chiamvimonvat, NHammock, BDSirish, P Methods of improving cell-based therapy US Patent  US11723929 Publication Date 8/15/2023 
Target
Name:
Epoxide hydrolase 1
Synonyms:
EPHX EPOX Epoxide hydrolase (HsEH) HYEP_HUMAN | Microsomal epoxide hydrolase
Type:
Protein
Mol. Mass.:
52954.28
Organism:
Homo sapiens (Human)
Description:
P07099
Residue:
455
  
Inhibitor
Name:
BDBM408992
Synonyms:
US10377744, Compound No. 13 US11123311, Compound 14 | US11723929, Compound 14
Type:
Small organic molecule
Emp. Form.:
C19H20F3N3O3
Mol. Mass.:
395.3756
SMILES:
Cc1occc1C(=O)N1CCC(CC1)NC(=O)Nc1ccc(cc1)C(F)(F)F
: