Target
Epoxide hydrolase 1
Ligand
BDBM409001
Substrate
Meas. Tech.
Inhibitors of Soluble Epoxide Hydrolase (sEH)
Ki
10.2±1.1 nM
Citation
 Chiamvimonvat, NHammock, BDSirish, P Methods of improving cell-based therapy US Patent  US11723929 Publication Date 8/15/2023 
Target
Name:
Epoxide hydrolase 1
Synonyms:
EPHX EPOX Epoxide hydrolase (HsEH) HYEP_HUMAN | Microsomal epoxide hydrolase
Type:
Protein
Mol. Mass.:
52954.28
Organism:
Homo sapiens (Human)
Description:
P07099
Residue:
455
  
Inhibitor
Name:
BDBM409001
Synonyms:
US10377744, Compound No. 22 US11723929, Compound 22
Type:
Small organic molecule
Emp. Form.:
C23H30F3N3O4
Mol. Mass.:
469.4972
SMILES:
OC(=O)CC1(CC(=O)N2CCC(CC2)NC(=O)Nc2ccc(cc2)C(F)(F)F)CCCCC1
: