Target
Epoxide hydrolase 1
Ligand
BDBM409002
Substrate
Meas. Tech.
Inhibitors of Soluble Epoxide Hydrolase (sEH)
Ki
0.870±0.13 nM
Citation
 Chiamvimonvat, NHammock, BDSirish, P Methods of improving cell-based therapy US Patent  US11723929 Publication Date 8/15/2023 
Target
Name:
Epoxide hydrolase 1
Synonyms:
EPHX EPOX Epoxide hydrolase (HsEH) HYEP_HUMAN | Microsomal epoxide hydrolase
Type:
Protein
Mol. Mass.:
52954.28
Organism:
Homo sapiens (Human)
Description:
P07099
Residue:
455
  
Inhibitor
Name:
BDBM409002
Synonyms:
US10377744, Compound No. 23 US11723929, Compound 23
Type:
Small organic molecule
Emp. Form.:
C16H19F4N3O3
Mol. Mass.:
377.334
SMILES:
CCC(=O)N1CCC(CC1)NC(=O)Nc1ccc(OC(F)(F)F)c(F)c1
: