Target
Epoxide hydrolase 1
Ligand
BDBM409003
Substrate
Meas. Tech.
Inhibitors of Soluble Epoxide Hydrolase (sEH)
Ki
0.150±0.04 nM
Citation
 Chiamvimonvat, NHammock, BDSirish, P Methods of improving cell-based therapy US Patent  US11723929 Publication Date 8/15/2023 
Target
Name:
Epoxide hydrolase 1
Synonyms:
EPHX EPOX Epoxide hydrolase (HsEH) HYEP_HUMAN | Microsomal epoxide hydrolase
Type:
Protein
Mol. Mass.:
52954.28
Organism:
Homo sapiens (Human)
Description:
P07099
Residue:
455
  
Inhibitor
Name:
BDBM409003
Synonyms:
US10377744, Compound No. 24 US11723929, Compound 24
Type:
Small organic molecule
Emp. Form.:
C17H19F4N3O3
Mol. Mass.:
389.3447
SMILES:
Fc1cc(NC(=O)NC2CCN(CC2)C(=O)C2CC2)ccc1OC(F)(F)F
: