Target
Epoxide hydrolase 1
Ligand
BDBM409004
Substrate
Meas. Tech.
Inhibitors of Soluble Epoxide Hydrolase (sEH)
Ki
0.700±0.01 nM
Citation
 Chiamvimonvat, NHammock, BDSirish, P Methods of improving cell-based therapy US Patent  US11723929 Publication Date 8/15/2023 
Target
Name:
Epoxide hydrolase 1
Synonyms:
EPHX EPOX Epoxide hydrolase (HsEH) HYEP_HUMAN | Microsomal epoxide hydrolase
Type:
Protein
Mol. Mass.:
52954.28
Organism:
Homo sapiens (Human)
Description:
P07099
Residue:
455
  
Inhibitor
Name:
BDBM409004
Synonyms:
US10377744, Compound No. 25 US11723929, Compound 25
Type:
Small organic molecule
Emp. Form.:
C18H21F4N3O4
Mol. Mass.:
419.3707
SMILES:
Fc1cc(NC(=O)NC2CCN(CC2)C(=O)[C@@H]2CCOC2)ccc1OC(F)(F)F
: